findcode search Test

How can I disassociate test suite from Test plan A and move the test suite along with test run details to another Test plan B

Stack Overflow Test plan A has multiple test suites with status not started, in progress and completed. The test suites that are in complete status due to project ne...

Test point not found error while adding test results to a test run using API

Stack Overflow Test point not found error while adding test results to a test run I want to update the status of test cases in Microsoft Test Manager/VSTS using APi...

Test point not found error while adding test results to a test run using API

Stack Overflow Test point not found error while adding test results to a test run I want to update the status of test cases in Microsoft Test Manager/VSTS using APi...

Test point not found error while adding test results to a test run using API

Stack Overflow Test point not found error while adding test results to a test run I want to update the status of test cases in Microsoft Test Manager/VSTS using APi...

Highly efficient hypothesis testing methods for regression-type tests with correlated observations and heterogeneous variance structure

BMC Bioinformatics For many practical hypothesis testing (H-T) applications, the data are correlated and/or with heterogeneous variance structure. The regression t-test ...

Highly efficient hypothesis testing methods for regression-type tests with correlated observations and heterogeneous variance structure

BMC Bioinformatics For many practical hypothesis testing (H-T) applications, the data are correlated and/or with heterogeneous variance structure. The regression t-test ...

Highly efficient hypothesis testing methods for regression-type tests with correlated observations and heterogeneous variance structure

BMC Bioinformatics For many practical hypothesis testing (H-T) applications, the data are correlated and/or with heterogeneous variance structure. The regression t-test ...

Highly efficient hypothesis testing methods for regression-type tests with correlated observations and heterogeneous variance structure

BMC Bioinformatics For many practical hypothesis testing (H-T) applications, the data are correlated and/or with heterogeneous variance structure. The regression t-test ...

'A test is using time, but is not advancing the test clock' in ZIO Test

Stack Overflow After migrating my Test to RC18, I get the following warning and the test is hanging: Warning: A test is using time, but is not advancing the test cl...

How to add all test run inside a test plan in test rail triggered from cypress

Stack Overflow We are using Cypress to automate UI test cases. We have recently integrated the cypress framework with test rail. It is able to create test run in te...

How to execute multiple test fragments through a single Thread Group in JMeter script

Stack Overflow I have a test plan in which i am using 5 Test Fragments given below and using a single Thread Group: Test Fragment A Test Fragment B Test Fragment C ...

Not like "*TEST*", "TEST", Not Like "*TEST*", Not Like "*TEST", Not Like "TEST*", Not Exists ()

Stack Overflow I've tried each of the below without success in an Access Query using Design & SQL. Nothing Seems to filter OUT anything with a [Status] = "TEST" or ...

Smoke test for iOS app

Stack Overflow As we all know, there are unit test and UI test in Xcode. I'm confused about the smoke test and regression test. For now, I need to write smoke test a...

Django unit test without creating test database every time I run

Stack Overflow Seems like "manage.py test" creates test database every time I run the test. Is there a way to prevent creating test database each time I run test but...

how can i place multiple test-suits in a single test-suit using Jest and supertest?

Stack Overflow I have created multiple test-suites and want them to run under a single test suite or a single describe test block. I have placed them like... descr...

Your test Suite must contain at least one test ( Refuses to count expect as a test when it passes )

Stack Overflow When I run my jest tests on my vue app, It produces an expected error when the test I wrote fails but if the test passes, instead of showing passed, i...

Failed to execute goal org.apache.maven.plugins:maven-surefire-plugin:3.0.0-M3:test (default-test) on project automation: There are test failures

Stack Overflow Not able to run a single test using: mvn -Dtest=SettingsTest#test* test I have followed the steps mentioned here: https://maven.apache.org/suref...

mocha Error: No test files found: "test/" npm ERR! Test failed

Stack Overflow Im trying to run mocha tests on linux > @ test C:\Users\wd.ssh\tel\qa_test\mocha-api-tests Error: No test files found: "test/" npm ERR! Test failed....

How to preserve django test database after running test cases

Stack Overflow When I run test cases by typing python manage.py test myapp After test cases completed, test databases deleted by default by django test runner. I d...

gcc compiler complain about test[0] error from char* test;

Stack Overflow I simply write this: char* test="test"; printf("%s",test[0]); it says seg fault; then I change to printf("%s",&test[0]); the error gone But this is...


How can I disassociate test suite from Test plan A and move the test suite along with test run details to another Test plan B

Stack Overflow Test plan A has multiple test suites with status not started, in progress and completed. The test suites that are in complete status due to project ne...


Test point not found error while adding test results to a test run using API

Stack Overflow Test point not found error while adding test results to a test run I want to update the status of test cases in Microsoft Test Manager/VSTS using APi...

Test point not found error while adding test results to a test run using API

Stack Overflow Test point not found error while adding test results to a test run I want to update the status of test cases in Microsoft Test Manager/VSTS using APi...

Test point not found error while adding test results to a test run using API

Stack Overflow Test point not found error while adding test results to a test run I want to update the status of test cases in Microsoft Test Manager/VSTS using APi...


Highly efficient hypothesis testing methods for regression-type tests with correlated observations and heterogeneous variance structure

BMC Bioinformatics For many practical hypothesis testing (H-T) applications, the data are correlated and/or with heterogeneous variance structure. The regression t-test ...

Highly efficient hypothesis testing methods for regression-type tests with correlated observations and heterogeneous variance structure

BMC Bioinformatics For many practical hypothesis testing (H-T) applications, the data are correlated and/or with heterogeneous variance structure. The regression t-test ...

Highly efficient hypothesis testing methods for regression-type tests with correlated observations and heterogeneous variance structure

BMC Bioinformatics For many practical hypothesis testing (H-T) applications, the data are correlated and/or with heterogeneous variance structure. The regression t-test ...

Highly efficient hypothesis testing methods for regression-type tests with correlated observations and heterogeneous variance structure

BMC Bioinformatics For many practical hypothesis testing (H-T) applications, the data are correlated and/or with heterogeneous variance structure. The regression t-test ...


'A test is using time, but is not advancing the test clock' in ZIO Test

Stack Overflow After migrating my Test to RC18, I get the following warning and the test is hanging: Warning: A test is using time, but is not advancing the test cl...


How to add all test run inside a test plan in test rail triggered from cypress

Stack Overflow We are using Cypress to automate UI test cases. We have recently integrated the cypress framework with test rail. It is able to create test run in te...


How to execute multiple test fragments through a single Thread Group in JMeter script

Stack Overflow I have a test plan in which i am using 5 Test Fragments given below and using a single Thread Group: Test Fragment A Test Fragment B Test Fragment C ...


Not like "*TEST*", "TEST", Not Like "*TEST*", Not Like "*TEST", Not Like "TEST*", Not Exists ()

Stack Overflow I've tried each of the below without success in an Access Query using Design & SQL. Nothing Seems to filter OUT anything with a [Status] = "TEST" or ...


Smoke test for iOS app

Stack Overflow As we all know, there are unit test and UI test in Xcode. I'm confused about the smoke test and regression test. For now, I need to write smoke test a...


Django unit test without creating test database every time I run

Stack Overflow Seems like "manage.py test" creates test database every time I run the test. Is there a way to prevent creating test database each time I run test but...


how can i place multiple test-suits in a single test-suit using Jest and supertest?

Stack Overflow I have created multiple test-suites and want them to run under a single test suite or a single describe test block. I have placed them like... descr...


Your test Suite must contain at least one test ( Refuses to count expect as a test when it passes )

Stack Overflow When I run my jest tests on my vue app, It produces an expected error when the test I wrote fails but if the test passes, instead of showing passed, i...


Failed to execute goal org.apache.maven.plugins:maven-surefire-plugin:3.0.0-M3:test (default-test) on project automation: There are test failures

Stack Overflow Not able to run a single test using: mvn -Dtest=SettingsTest#test* test I have followed the steps mentioned here: https://maven.apache.org/suref...


mocha Error: No test files found: "test/" npm ERR! Test failed

Stack Overflow Im trying to run mocha tests on linux > @ test C:\Users\wd.ssh\tel\qa_test\mocha-api-tests Error: No test files found: "test/" npm ERR! Test failed....


How to preserve django test database after running test cases

Stack Overflow When I run test cases by typing python manage.py test myapp After test cases completed, test databases deleted by default by django test runner. I d...


gcc compiler complain about test[0] error from char* test;

Stack Overflow I simply write this: char* test="test"; printf("%s",test[0]); it says seg fault; then I change to printf("%s",&test[0]); the error gone But this is...